Target
5-hydroxytryptamine receptor 1A
Ligand
BDBM50209163
Substrate
Meas. Tech.
ChEBML_1513
Ki
65±n/a nM
Citation
 Agarwal, APearson, PPTaylor, EWLi, HBDahlgren, THerslöf, MYang, YLambert, GNelson, DLRegan, JW Three-dimensional quantitative structure-activity relationships of 5-HT receptor binding data for tetrahydropyridinylindole derivatives: a comparison of the Hansch and CoMFA methods. J Med Chem 36:4006-14 (1993)  
Target
Name:
5-hydroxytryptamine receptor 1A
Synonyms:
5-HT-1A 5-HT1A 5-hydroxytryptamine receptor 1A (5HT1A) 5ht1a Htr1a Serotonin 1a (5-HT1a) receptor/Adrenergic receptor alpha-1 | Serotonin receptor 1A
Type:
G Protein-Coupled Receptor (GPCR)
Mol. Mass.:
46445.29
Organism:
Rattus norvegicus (rat)
Description:
Binding assays were performed using rat hippocampal membranes.
Residue:
422
  
Inhibitor
Name:
BDBM50209163
Synonyms:
5-Fluoro-3-(1-methyl-1,2,3,6-tetrahydro-pyridin-4-yl)-1H-indole CHEMBL27025
Type:
Small organic molecule
Emp. Form.:
C14H15FN2
Mol. Mass.:
230.2807
SMILES:
CN1CCC(=CC1)c1c[nH]c2ccc(F)cc12
: