Target
Poly [ADP-ribose] polymerase tankyrase-2
Ligand
BDBM50229706
Substrate
Meas. Tech.
ChEMBL_1644275 (CHEMBL3993204)
IC50
6.3±n/a nM
Citation
 Hu, YStumpfe, DBajorath, J Recent Advances in Scaffold Hopping. J Med Chem 60:1238-1246 (2017)  
Target
Name:
Poly [ADP-ribose] polymerase tankyrase-2
Synonyms:
(ARTD6 or PARP5b) Poly [ADP-ribose] polymerase tankyrase-2 TNKL TNKS2_HUMAN Tankyrase 2 Tankyrase-2 Tankyrase-2 (TNKS2)
Type:
Enzyme
Mol. Mass.:
126937.16
Organism:
Homo sapiens (Human)
Description:
Q9H2K2
Residue:
1166
  
Inhibitor
Name:
BDBM50229706
Synonyms:
CHEMBL4080549
Type:
Small organic molecule
Emp. Form.:
C13H12N2S
Mol. Mass.:
228.313
SMILES:
C1Cc2nc(ncc2CS1)-c1ccccc1
: