Target
Poly [ADP-ribose] polymerase tankyrase-2
Ligand
BDBM50229708
Substrate
Meas. Tech.
ChEMBL_1644275 (CHEMBL3993204)
IC50
2.5±n/a nM
Citation
 Hu, YStumpfe, DBajorath, J Recent Advances in Scaffold Hopping. J Med Chem 60:1238-1246 (2017)  
Target
Name:
Poly [ADP-ribose] polymerase tankyrase-2
Synonyms:
(ARTD6 or PARP5b) Poly [ADP-ribose] polymerase tankyrase-2 TNKL TNKS2_HUMAN Tankyrase 2 Tankyrase-2 Tankyrase-2 (TNKS2)
Type:
Enzyme
Mol. Mass.:
126937.16
Organism:
Homo sapiens (Human)
Description:
Q9H2K2
Residue:
1166
  
Inhibitor
Name:
BDBM50229708
Synonyms:
CHEMBL4069862
Type:
Small organic molecule
Emp. Form.:
C13H14N2S
Mol. Mass.:
230.329
SMILES:
C1CC2=C(CS1)N=C(NC2)c1ccccc1
: