Target
Angiopoietin-1 receptor
Ligand
BDBM50230189
Substrate
Meas. Tech.
ChEMBL_1644611 (CHEMBL3993540)
IC50
0.600000±n/a nM
Citation
 Zhang, LShan, YLi, CSun, YSu, PWang, JLi, LPan, XZhang, J Discovery of novel anti-angiogenesis agents. Part 6: Multi-targeted RTK inhibitors. Eur J Med Chem 127:275-285 (2017)  
Target
Name:
Angiopoietin-1 receptor
Synonyms:
TEK TIE2_HUMAN Tyrosine-protein kinase receptor (TIE-2) Tyrosine-protein kinase receptor TEK (p140 TEK) Tyrosine-protein kinase receptor TIE2/TEK VMCM1 p140 TEK
Type:
Enzyme
Mol. Mass.:
125835.70
Organism:
Homo sapiens (Human)
Description:
Q02763
Residue:
1124
  
Inhibitor
Name:
BDBM50230189
Synonyms:
CHEMBL4066813
Type:
Small organic molecule
Emp. Form.:
C22H15BrF3N5OS
Mol. Mass.:
534.352
SMILES:
Nc1ncc2ccc(cc2n1)-c1ccc(NC(=S)Nc2cc(Br)ccc2OC(F)(F)F)cc1
: