Target
Angiopoietin-1 receptor
Ligand
BDBM50230174
Substrate
Meas. Tech.
ChEMBL_1644611 (CHEMBL3993540)
IC50
2±n/a nM
Citation
 Zhang, LShan, YLi, CSun, YSu, PWang, JLi, LPan, XZhang, J Discovery of novel anti-angiogenesis agents. Part 6: Multi-targeted RTK inhibitors. Eur J Med Chem 127:275-285 (2017)  
Target
Name:
Angiopoietin-1 receptor
Synonyms:
TEK TIE2_HUMAN Tyrosine-protein kinase receptor (TIE-2) Tyrosine-protein kinase receptor TEK (p140 TEK) Tyrosine-protein kinase receptor TIE2/TEK VMCM1 p140 TEK
Type:
Enzyme
Mol. Mass.:
125835.70
Organism:
Homo sapiens (Human)
Description:
Q02763
Residue:
1124
  
Inhibitor
Name:
BDBM50230174
Synonyms:
CHEMBL4085495
Type:
Small organic molecule
Emp. Form.:
C25H19BrF3N5O2
Mol. Mass.:
558.35
SMILES:
Nc1n[nH]c2cccc(-c3cccc(NC(=O)C4(CC4)C(=O)Nc4cc(Br)cc(c4)C(F)(F)F)c3)c12
: