Target
Atrial natriuretic peptide receptor 1
Ligand
BDBM50230986
Substrate
Meas. Tech.
ChEMBL_1645075 (CHEMBL3994004)
EC50
0.100000±n/a nM
Citation
 Iwaki, TOyama, YTomoo, TTanaka, TOkamura, YSugiyama, MYamaki, AFuruya, M Discovery and dimeric approach of novel Natriuretic Peptide Receptor A (NPR-A) agonists. Bioorg Med Chem 25:1762-1769 (2017)  
Target
Name:
Atrial natriuretic peptide receptor 1
Synonyms:
ANP-A ANPRA_HUMAN Atrial natriuretic peptide receptor GC-A NPR-A | NPR1
Type:
PROTEIN
Mol. Mass.:
118919.35
Organism:
Homo sapiens (Human)
Description:
ChEMBL_700223
Residue:
1061
  
Inhibitor
Name:
BDBM50230986
Synonyms:
Carperitide | SUN-4936
Type:
Small organic molecule
Emp. Form.:
C127H203N45O39S3
Mol. Mass.:
3080.444
SMILES:
[H][C@]1(NC(=O)[C@H](CCCNC(N)=N)NC(=O)[C@H](CC(O)=O)NC(=O)[C@H](CCSC)NC(=O)[C@H](CCCNC(N)=N)NC(=O)CNC(=O)CNC(=O)[C@H](Cc2ccccc2)NC(=O)[C@H](CSSC[C@H](NC(=O)CNC(=O)[C@H](CC(C)C)NC(=O)CNC(=O)[C@H](CO)NC(=O)[C@H](CCC(N)=O)NC(=O)[C@H](C)NC(=O)CNC1=O)C(=O)N[C@@H](CC(N)=O)C(=O)N[C@@H](CO)C(=O)N[C@@H](Cc1ccccc1)C(=O)N[C@@H](CCCNC(N)=N)C(=O)N[C@@H](Cc1ccc(O)cc1)C(O)=O)NC(=O)[C@H](CO)NC(=O)[C@H](CO)NC(=O)[C@H](CCCNC(N)=N)NC(=O)[C@H](CCCNC(N)=N)NC(=O)[C@H](CC(C)C)NC(=O)[C@@H](N)CO)[C@@H](C)CC
: