Target
Protein mono-ADP-ribosyltransferase PARP4
Ligand
BDBM50446130
Substrate
Meas. Tech.
ChEMBL_1646307 (CHEMBL3995363)
IC50
839±n/a nM
Citation
 Thorsell, AGEkblad, TKarlberg, TLöw, MPinto, AFTrésaugues, LMoche, MCohen, MSSchüler, H Structural Basis for Potency and Promiscuity in Poly(ADP-ribose) Polymerase (PARP) and Tankyrase Inhibitors. J Med Chem 60:1262-1271 (2017)  
Target
Name:
Protein mono-ADP-ribosyltransferase PARP4
Synonyms:
(ARTD4 or PARP4) 2.4.2.- ADP-ribosyltransferase diphtheria toxin-like 4 ADPRTL1 KIAA0177 PARP-4 PARP4 PARPL Poly [ADP-ribose] polymerase 4 VPARP | Vault poly(ADP-ribose) polymerase
Type:
Mol. Mass.:
192563.23
Organism:
Homo sapiens (Human)
Description:
Q9UKK3
Residue:
1724
  
Inhibitor
Name:
BDBM50446130
Synonyms:
AG-014699 RUCAPARIB CAMSYLATE | Rucaparib
Type:
Small organic molecule
Emp. Form.:
C19H18FN3O
Mol. Mass.:
323.3641
SMILES:
CNCc1ccc(cc1)-c1[nH]c2cc(F)cc3C(=O)NCCc1c23
: