Target
Protein mono-ADP-ribosyltransferase PARP3
Ligand
BDBM27135
Substrate
Meas. Tech.
ChEBML_1646306
IC50
2138±n/a nM
Citation
 Thorsell, AGEkblad, TKarlberg, TLöw, MPinto, AFTrésaugues, LMoche, MCohen, MSSchüler, H Structural Basis for Potency and Promiscuity in Poly(ADP-ribose) Polymerase (PARP) and Tankyrase Inhibitors. J Med Chem 60:1262-1271 (2017)  
Target
Name:
Protein mono-ADP-ribosyltransferase PARP3
Synonyms:
ADP-ribosyltransferase diphtheria toxin-like 3 ADPRT3 ARTD3 NAD(+) ADP-ribosyltransferase 3 PARP3 Poly [ADP-ribose] polymerase 3 hPARP-3 | pADPRT-3
Type:
PROTEIN
Mol. Mass.:
60091.40
Organism:
Homo sapiens (Human)
Description:
ChEMBL_109545
Residue:
533
  
Inhibitor
Name:
BDBM27135
Synonyms:
2-[(2R)-2-methylpyrrolidin-2-yl]-1H-1,3-benzodiazole-4-carboxamide benzimidazole carboxamide, 3a
Type:
Small organic molecule
Emp. Form.:
C13H16N4O
Mol. Mass.:
244.2923
SMILES:
C[C@@]1(CCCN1)c1nc2cccc(C(N)=O)c2[nH]1
: