Target
Protein mono-ADP-ribosyltransferase PARP10
Ligand
BDBM27135
Substrate
Meas. Tech.
ChEMBL_1646312 (CHEMBL3995368)
IC50
43800±n/a nM
Citation
 Thorsell, AGEkblad, TKarlberg, TLöw, MPinto, AFTrésaugues, LMoche, MCohen, MSSchüler, H Structural Basis for Potency and Promiscuity in Poly(ADP-ribose) Polymerase (PARP) and Tankyrase Inhibitors. J Med Chem 60:1262-1271 (2017)  
Target
Name:
Protein mono-ADP-ribosyltransferase PARP10
Synonyms:
2.4.2.- ADP-ribosyltransferase diphtheria toxin-like 10 Human diphtheria toxin-like ADP-ribosyltransferase (ARTD10 or PARP10, L926Y)) Human diphtheria toxin-like ADP-ribosyltransferase (ARTD10 or PARP10, S927A)) PARP-10 Poly [ADP-ribose] polymerase 10
Type:
Mol. Mass.:
109953.63
Organism:
Homo sapiens (Human)
Description:
Q53GL7
Residue:
1025
  
Inhibitor
Name:
BDBM27135
Synonyms:
2-[(2R)-2-methylpyrrolidin-2-yl]-1H-1,3-benzodiazole-4-carboxamide benzimidazole carboxamide, 3a
Type:
Small organic molecule
Emp. Form.:
C13H16N4O
Mol. Mass.:
244.2923
SMILES:
C[C@@]1(CCCN1)c1nc2cccc(C(N)=O)c2[nH]1
: