Target
Protein mono-ADP-ribosyltransferase PARP4
Ligand
BDBM50145156
Substrate
Meas. Tech.
ChEMBL_1646307 (CHEMBL3995363)
IC50
254±n/a nM
Citation
 Thorsell, AGEkblad, TKarlberg, TLöw, MPinto, AFTrésaugues, LMoche, MCohen, MSSchüler, H Structural Basis for Potency and Promiscuity in Poly(ADP-ribose) Polymerase (PARP) and Tankyrase Inhibitors. J Med Chem 60:1262-1271 (2017)  
Target
Name:
Protein mono-ADP-ribosyltransferase PARP4
Synonyms:
(ARTD4 or PARP4) 2.4.2.- ADP-ribosyltransferase diphtheria toxin-like 4 ADPRTL1 KIAA0177 PARP-4 PARP4 PARPL Poly [ADP-ribose] polymerase 4 VPARP | Vault poly(ADP-ribose) polymerase
Type:
Mol. Mass.:
192563.23
Organism:
Homo sapiens (Human)
Description:
Q9UKK3
Residue:
1724
  
Inhibitor
Name:
BDBM50145156
Synonyms:
CHEMBL3764816
Type:
Small organic molecule
Emp. Form.:
C19H14F2N6O
Mol. Mass.:
380.3509
SMILES:
Cn1ncnc1[C@H]1[C@@H](Nc2cc(F)cc3c2c1n[nH]c3=O)c1ccc(F)cc1
: