Target
Protein mono-ADP-ribosyltransferase PARP10
Ligand
BDBM50316226
Substrate
Meas. Tech.
ChEMBL_1646311 (CHEMBL3995367)
IC50
1950±n/a nM
Citation
 Thorsell, AGEkblad, TKarlberg, TLöw, MPinto, AFTrésaugues, LMoche, MCohen, MSSchüler, H Structural Basis for Potency and Promiscuity in Poly(ADP-ribose) Polymerase (PARP) and Tankyrase Inhibitors. J Med Chem 60:1262-1271 (2017)  
Target
Name:
Protein mono-ADP-ribosyltransferase PARP10
Synonyms:
2.4.2.- ADP-ribosyltransferase diphtheria toxin-like 10 Human diphtheria toxin-like ADP-ribosyltransferase (ARTD10 or PARP10, L926Y)) Human diphtheria toxin-like ADP-ribosyltransferase (ARTD10 or PARP10, S927A)) PARP-10 Poly [ADP-ribose] polymerase 10
Type:
Mol. Mass.:
109953.63
Organism:
Homo sapiens (Human)
Description:
Q53GL7
Residue:
1025
  
Inhibitor
Name:
BDBM50316226
Synonyms:
(S)-2-(4-(piperidin-3-yl)phenyl)-2H-indazole-7-carboxamide MK-4827 | Niraparib
Type:
Small organic molecule
Emp. Form.:
C19H20N4O
Mol. Mass.:
320.3883
SMILES:
NC(=O)c1cccc2cn(nc12)-c1ccc(cc1)[C@@H]1CCCNC1
: