Target
Protein mono-ADP-ribosyltransferase PARP14
Ligand
BDBM50232346
Substrate
Meas. Tech.
ChEMBL_1646314 (CHEMBL3995370)
IC50
3400±n/a nM
Citation
 Thorsell, AGEkblad, TKarlberg, TLöw, MPinto, AFTrésaugues, LMoche, MCohen, MSSchüler, H Structural Basis for Potency and Promiscuity in Poly(ADP-ribose) Polymerase (PARP) and Tankyrase Inhibitors. J Med Chem 60:1262-1271 (2017)  
Target
Name:
Protein mono-ADP-ribosyltransferase PARP14
Synonyms:
(ARTD8 or PARP14) 2.4.2.- ADP-ribosyltransferase diphtheria toxin-like 8 B aggressive lymphoma protein 2 BAL2  KIAA1268 PAR14_HUMAN PARP14 Synonyms=BAL2
Type:
Mol. Mass.:
202812.41
Organism:
Homo sapiens (Human)
Description:
Q460N5
Residue:
1801
  
Inhibitor
Name:
BDBM50232346
Synonyms:
CHEMBL4101890
Type:
Small organic molecule
Emp. Form.:
C25H28N6O
Mol. Mass.:
428.5294
SMILES:
C[C@H]1CN(C[C@@H](C)N1)c1cc(C)c(cn1)-c1ccc(cc1)-c1nc2n(C)ccc2c(=O)[nH]1
: