Target
Amine oxidase [flavin-containing] A
Ligand
BDBM50232425
Substrate
Meas. Tech.
ChEMBL_1647766 (CHEMBL3996822)
IC50
0.660693±n/a nM
Citation
 Tzvetkov, NTStammler, HGNeumann, BHristova, SAntonov, LGastreich, M Crystal structures, binding interactions, and ADME evaluation of brain penetrant N-substituted indazole-5-carboxamides as subnanomolar, selective monoamine oxidase B and dual MAO-A/B inhibitors. Eur J Med Chem 127:470-492 (2017)  
Target
Name:
Amine oxidase [flavin-containing] A
Synonyms:
AOFA_HUMAN MAO-A Monoamine oxidase Monoamine oxidase type A (MAO A) Monoamine oxidase type A (MAOA)
Type:
Protein
Mol. Mass.:
59689.53
Organism:
Homo sapiens (Human)
Description:
P21397
Residue:
527
  
Inhibitor
Name:
BDBM50232425
Synonyms:
CHEMBL4061639
Type:
Small organic molecule
Emp. Form.:
C15H11ClFN3O
Mol. Mass.:
303.719
SMILES:
Cn1ncc2cc(ccc12)C(=O)Nc1ccc(F)c(Cl)c1
: