Target
Serine/threonine-protein kinase receptor R3
Ligand
BDBM50262079
Substrate
Meas. Tech.
ChEMBL_1649712 (CHEMBL3998846)
IC50
11±n/a nM
Citation
 Cho, HSengupta, SJeon, SSHur, WChoi, HGSeo, HSLee, BJKim, JHChung, MJeon, NLKim, NDSim, T Identification of the First Selective Activin Receptor-Like Kinase 1 Inhibitor, a Reversible Version of L-783277. J Med Chem 60:1495-1508 (2017)  
Target
Name:
Serine/threonine-protein kinase receptor R3
Synonyms:
ACVL1_HUMAN ACVRLK1 Activin receptor-like kinase 1 (ALK-1) | Serine/threonine-protein kinase receptor R3 (ALK1)
Type:
Enzyme
Mol. Mass.:
56134.46
Organism:
Homo sapiens (Human)
Description:
P37023
Residue:
503
  
Inhibitor
Name:
BDBM50262079
Synonyms:
4-(6-(4-(piperazin-1-yl)phenyl)pyrazolo[1,5-a]pyrimidin-3-yl)quinoline CHEMBL513147 | LDN-193189
Type:
Small organic molecule
Emp. Form.:
C25H22N6
Mol. Mass.:
406.4824
SMILES:
C1CN(CCN1)c1ccc(cc1)-c1cnc2c(cnn2c1)-c1ccnc2ccccc12
: