Target
Receptor-interacting serine/threonine-protein kinase 1
Ligand
BDBM50159508
Substrate
Meas. Tech.
ChEMBL_1650163 (CHEMBL3999297)
IC50
40±n/a nM
Citation
 Harris, PABerger, SBJeong, JUNagilla, RBandyopadhyay, DCampobasso, NCapriotti, CACox, JADare, LDong, XEidam, PMFinger, JNHoffman, SJKang, JKasparcova, VKing, BWLehr, RLan, YLeister, LKLich, JDMacDonald, TTMiller, NAOuellette, MTPao, CSRahman, AReilly, MARendina, ARRivera, EJSchaeffer, MCSehon, CASinghaus, RRSun, HHSwift, BATotoritis, RDVossenkämper, AWard, PWisnoski, DDZhang, DMarquis, RWGough, PJBertin, J Discovery of a First-in-Class Receptor Interacting Protein 1 (RIP1) Kinase Specific Clinical Candidate (GSK2982772) for the Treatment of Inflammatory Diseases. J Med Chem 60:1247-1261 (2017)  
Target
Name:
Receptor-interacting serine/threonine-protein kinase 1
Synonyms:
Cell death protein RIP RIP-1 RIPK1 Receptor-interacting protein 1
Type:
Enzyme Catalytic Domain
Mol. Mass.:
75926.99
Organism:
Homo sapiens (Human)
Description:
Q13546
Residue:
671
  
Inhibitor
Name:
BDBM50159508
Synonyms:
CHEMBL3786078
Type:
Small organic molecule
Emp. Form.:
C21H20N4O3
Mol. Mass.:
376.4085
SMILES:
CN1c2ccccc2NC[C@H](NC(=O)c2cc(Cc3ccccc3)on2)C1=O
: