Target
Estrogen-related receptor gamma
Ligand
BDBM50233268
Substrate
Meas. Tech.
ChEMBL_1650380 (CHEMBL3999514)
IC50
1000±n/a nM
Citation
 Yu, DDHuss, JMLi, HForman, BM Identification of novel inverse agonists of estrogen-related receptors ERR¿ and ERRß. Bioorg Med Chem 25:1585-1599 (2017)  
Target
Name:
Estrogen-related receptor gamma
Synonyms:
ERR gamma-2 ERR3_HUMAN ESRRG Estrogen-Related Receptor, gamma KIAA0832 Nuclear receptor subfamily 3 group B member 3
Type:
PROTEIN
Mol. Mass.:
51305.00
Organism:
Homo sapiens (Human)
Description:
ChEMBL_1501351
Residue:
458
  
Inhibitor
Name:
BDBM50233268
Synonyms:
CHEMBL4073790
Type:
Small organic molecule
Emp. Form.:
C28H33NO2
Mol. Mass.:
415.5671
SMILES:
CC(C)C\C(=C(/c1ccc(O)cc1)c1ccc(OCCN(C)C)cc1)c1ccccc1
: