Target
Estrogen-related receptor gamma
Ligand
BDBM50233273
Substrate
Meas. Tech.
ChEMBL_1650380 (CHEMBL3999514)
IC50
350±n/a nM
Citation
 Yu, DDHuss, JMLi, HForman, BM Identification of novel inverse agonists of estrogen-related receptors ERR¿ and ERRß. Bioorg Med Chem 25:1585-1599 (2017)  
Target
Name:
Estrogen-related receptor gamma
Synonyms:
ERR gamma-2 ERR3_HUMAN ESRRG Estrogen-Related Receptor, gamma KIAA0832 Nuclear receptor subfamily 3 group B member 3
Type:
PROTEIN
Mol. Mass.:
51305.00
Organism:
Homo sapiens (Human)
Description:
ChEMBL_1501351
Residue:
458
  
Inhibitor
Name:
BDBM50233273
Synonyms:
CHEMBL4064664
Type:
Small organic molecule
Emp. Form.:
C30H35NO4
Mol. Mass.:
473.6032
SMILES:
CC(CO)C\C(=C(\c1ccc(OCCN(C)C)cc1)c1ccc(OC(C)=O)cc1)c1ccccc1
: