Target
Prostaglandin D2 receptor
Ligand
BDBM50233520
Substrate
Meas. Tech.
ChEBML_1650983
IC50
>10000±n/a nM
Citation
 Sandham, DABarker, LBrown, LBrown, ZBudd, DCharlton, SJChatterjee, DCox, BDubois, GDuggan, NHall, EHatto, JMaas, JManini, JProfit, RRiddy, DRitchie, CSohal, BShaw, DStringer, RSykes, DAThomas, MTurner, KLWatson, SJWest, RWillard, EWilliams, GWillis, J Discovery of Fevipiprant (NVP-QAW039), a Potent and Selective DP ACS Med Chem Lett 8:582-586 (2017)  
Target
Name:
Prostaglandin D2 receptor
Synonyms:
PD2R_HUMAN Prostaglandin D2 Prostanoid DP receptor
Type:
Enzyme
Mol. Mass.:
40288.87
Organism:
Homo sapiens (Human)
Description:
Q13258
Residue:
359
  
Inhibitor
Name:
BDBM50233520
Synonyms:
Fevipiprant QAW039
Type:
Small organic molecule
Emp. Form.:
C19H17F3N2O4S
Mol. Mass.:
426.409
SMILES:
Cc1c(CC(O)=O)c2cccnc2n1Cc1ccc(cc1C(F)(F)F)S(C)(=O)=O
: