Target
Glutamate receptor ionotropic, kainate 3
Ligand
BDBM50200526
Substrate
Meas. Tech.
ChEMBL_1652085 (CHEMBL4001340)
Ki
8900±n/a nM
Citation
 Krogsgaard-Larsen, NDelgar, CGKoch, KBrown, PMMøller, CHan, LHuynh, THHansen, SWNielsen, BBowie, DPickering, DSKastrup, JSFrydenvang, KBunch, L Design and Synthesis of a Series of l-trans-4-Substituted Prolines as Selective Antagonists for the Ionotropic Glutamate Receptors Including Functional and X-ray Crystallographic Studies of New Subtype Selective Kainic Acid Receptor Subtype 1 (GluK1) Antagonist (2S,4R)-4-(2-Carboxyphenoxy)pyrrolidin J Med Chem 60:441-457 (2017)  
Target
Name:
Glutamate receptor ionotropic, kainate 3
Synonyms:
EAA5 GLUR7 GRIK3_HUMAN Glutamate receptor 7 Glutamate receptor ionotropic kainate 3 Glutamate-Kainate 7
Type:
Enzyme Catalytic Domain
Mol. Mass.:
104046.44
Organism:
Homo sapiens (Human)
Description:
Glutamate-Kainate 7 0 HUMAN::Q13003
Residue:
919
  
Inhibitor
Name:
BDBM50200526
Synonyms:
CHEMBL1234118
Type:
Small organic molecule
Emp. Form.:
C16H24F2N2O4
Mol. Mass.:
346.3696
SMILES:
OC(=O)[C@@H]1CC(F)(F)CN1C[C@H]1CC[C@H]2CN[C@@H](C[C@H]2C1)C(O)=O
: