Target
Glutamate receptor ionotropic, kainate 2
Ligand
BDBM50234109
Substrate
Meas. Tech.
ChEMBL_1652078 (CHEMBL4001333)
Ki
>100000±n/a nM
Citation
 Krogsgaard-Larsen, NDelgar, CGKoch, KBrown, PMMøller, CHan, LHuynh, THHansen, SWNielsen, BBowie, DPickering, DSKastrup, JSFrydenvang, KBunch, L Design and Synthesis of a Series of l-trans-4-Substituted Prolines as Selective Antagonists for the Ionotropic Glutamate Receptors Including Functional and X-ray Crystallographic Studies of New Subtype Selective Kainic Acid Receptor Subtype 1 (GluK1) Antagonist (2S,4R)-4-(2-Carboxyphenoxy)pyrrolidin J Med Chem 60:441-457 (2017)  
Target
Name:
Glutamate receptor ionotropic, kainate 2
Synonyms:
GRIK2_RAT Glutamate receptor ionotropic kainate 2 Ionotropic glutamate receptor kainate 2/5
Type:
PROTEIN
Mol. Mass.:
102478.61
Organism:
Rattus norvegicus
Description:
ChEMBL_936439
Residue:
908
  
Inhibitor
Name:
BDBM50234109
Synonyms:
CHEMBL4067910
Type:
Small organic molecule
Emp. Form.:
C16H15NO5
Mol. Mass.:
301.294
SMILES:
OC(=O)[C@@H]1C[C@H](CN1)Oc1ccc2ccccc2c1C(O)=O
: