Target
Glutamate receptor ionotropic, kainate 3
Ligand
BDBM50234110
Substrate
Meas. Tech.
ChEMBL_1652079 (CHEMBL4001334)
Ki
30000±n/a nM
Citation
 Krogsgaard-Larsen, NDelgar, CGKoch, KBrown, PMMøller, CHan, LHuynh, THHansen, SWNielsen, BBowie, DPickering, DSKastrup, JSFrydenvang, KBunch, L Design and Synthesis of a Series of l-trans-4-Substituted Prolines as Selective Antagonists for the Ionotropic Glutamate Receptors Including Functional and X-ray Crystallographic Studies of New Subtype Selective Kainic Acid Receptor Subtype 1 (GluK1) Antagonist (2S,4R)-4-(2-Carboxyphenoxy)pyrrolidin J Med Chem 60:441-457 (2017)  
Target
Name:
Glutamate receptor ionotropic, kainate 3
Synonyms:
GRIK3_RAT Glutamate receptor ionotropic kainate 3 Grik3
Type:
PROTEIN
Mol. Mass.:
104080.46
Organism:
Rattus norvegicus
Description:
ChEMBL_1447329
Residue:
919
  
Inhibitor
Name:
BDBM50234110
Synonyms:
CHEMBL4090961
Type:
Small organic molecule
Emp. Form.:
C14H15NO6
Mol. Mass.:
293.272
SMILES:
CC(=O)c1ccc(O[C@H]2CN[C@@H](C2)C(O)=O)c(c1)C(O)=O
: