Target
Tryptophan 5-hydroxylase 1
Ligand
BDBM50234201
Substrate
Meas. Tech.
ChEMBL_1652543 (CHEMBL4001798)
IC50
23±n/a nM
Citation
 Goldberg, DRDe Lombaert, SAiello, RBourassa, PBarucci, NZhang, QParalkar, VStein, AJHolt, MValentine, JZavadoski, W Optimization of spirocyclic proline tryptophan hydroxylase-1 inhibitors. Bioorg Med Chem Lett 27:413-419 (2017)  
Target
Name:
Tryptophan 5-hydroxylase 1
Synonyms:
TPH TPH1_HUMAN TRPH | Tryptophan 5-monooxygenase 1
Type:
PROTEIN
Mol. Mass.:
50990.64
Organism:
Homo sapiens (Human)
Description:
ChEMBL_1361824
Residue:
444
  
Inhibitor
Name:
BDBM50234201
Synonyms:
CHEMBL4078797
Type:
Small organic molecule
Emp. Form.:
C31H35ClF3N5O3
Mol. Mass.:
618.09
SMILES:
CC(C)(C)c1cccc(c1)-c1cc(Cl)ccc1[C@@H](Oc1cc(nc(N)n1)N1CCC2(CN[C@@H](C2)C(O)=O)CC1)C(F)(F)F
: