Target
Receptor-type tyrosine-protein kinase FLT3
Ligand
BDBM50234238
Substrate
Meas. Tech.
ChEMBL_1652603 (CHEMBL4001858)
IC50
33±n/a nM
Citation
 Oh, CKim, HKang, JSYun, JSim, JKim, HMHan, G Synthetic strategy for increasing solubility of potential FLT3 inhibitor thieno[2,3-d]pyrimidine derivatives through structural modifications at the C Bioorg Med Chem Lett 27:496-500 (2017)  
Target
Name:
Receptor-type tyrosine-protein kinase FLT3
Synonyms:
CD135 FL cytokine receptor FLK2 FLT3 Fetal liver kinase-2 Fms-like tyrosine kinase 3 (Flt-3) STK-1 Stem cell tyrosine kinase 1
Type:
Enzyme
Mol. Mass.:
112888.62
Organism:
Homo sapiens (Human)
Description:
P36888
Residue:
993
  
Inhibitor
Name:
BDBM50234238
Synonyms:
CHEMBL4086034
Type:
Small organic molecule
Emp. Form.:
C15H11N5O2S2
Mol. Mass.:
357.41
SMILES:
CC1=CC(=O)N(Nc2nc(nc3sc(C)cc23)-c2nccs2)C1=O
: