Target
Carboxylic ester hydrolase
Ligand
BDBM8960
Substrate
Meas. Tech.
ChEMBL_1654039 (CHEMBL4003405)
IC50
37300±n/a nM
Citation
 Li, YQiang, XLuo, LYang, XXiao, GLiu, QAi, JTan, ZDeng, Y Aurone Mannich base derivatives as promising multifunctional agents with acetylcholinesterase inhibition, anti-ß-amyloid aggragation and neuroprotective properties for the treatment of Alzheimer's disease. Eur J Med Chem 126:762-775 (2017)  
Target
Name:
Carboxylic ester hydrolase
Synonyms:
Acetylcholinesterase and butyrylcholinesterase (AChE and BChE) Butyrylcholinesterase (BuChE) | butyrylcholinesterase precursor
Type:
Enzyme
Mol. Mass.:
67776.22
Organism:
Rattus norvegicus (rat)
Description:
Residue:
597
  
Inhibitor
Name:
BDBM8960
Synonyms:
(+/-)-2-[(1-benzylpiperidin-4-yl)methyl]-5,6-dimethoxy-indan-1-one Aricept CHEMBL1678 CHEMBL502 Donepezil E2020 US9346818, DPH US9663465, Donepezil
Type:
Small organic molecule
Emp. Form.:
C24H29NO3
Mol. Mass.:
379.492
SMILES:
COc1cc2CC(CC3CCN(Cc4ccccc4)CC3)C(=O)c2cc1OC
: