Target
Tyrosine-protein kinase JAK1
Ligand
BDBM50234899
Substrate
Meas. Tech.
ChEMBL_1654088 (CHEMBL4003454)
IC50
2.3±n/a nM
Citation
 Jones, PStorer, RISabnis, YAWakenhut, FMWhitlock, GAEngland, KSMukaiyama, TDehnhardt, CMCoe, JWKortum, SWChrencik, JEBrown, DGJones, RMMurphy, JRYeoh, TMorgan, PKilty, I Design and Synthesis of a Pan-Janus Kinase Inhibitor Clinical Candidate (PF-06263276) Suitable for Inhaled and Topical Delivery for the Treatment of Inflammatory Diseases of the Lungs and Skin. J Med Chem 60:767-786 (2017)  
Target
Name:
Tyrosine-protein kinase JAK1
Synonyms:
JAK-1 JAK1A JAK1_HUMAN Janus kinase 1 (JAK1) | Janus kinase 1 JAK1
Type:
Protein
Mol. Mass.:
133293.73
Organism:
Homo sapiens (Human)
Description:
P23458
Residue:
1154
  
Inhibitor
Name:
BDBM50234899
Synonyms:
CHEMBL4089515
Type:
Small organic molecule
Emp. Form.:
C24H30N6O4S
Mol. Mass.:
498.598
SMILES:
C[C@@H]1CCN(C[C@@H]1N(C)c1ncnc2[nH]ccc12)C(=O)N1CC[C@H](C1)S(=O)(=O)c1cccc(O)c1
: