Target
Poly [ADP-ribose] polymerase tankyrase-1
Ligand
BDBM50234921
Substrate
Meas. Tech.
ChEMBL_1654155 (CHEMBL4003521)
IC50
34±n/a nM
Citation
 Nathubhai, AHaikarainen, TKoivunen, JMurthy, SKoumanov, FLloyd, MDHolman, GDPihlajaniemi, TTosh, DLehtiö, LThreadgill, MD Highly Potent and Isoform Selective Dual Site Binding Tankyrase/Wnt Signaling Inhibitors That Increase Cellular Glucose Uptake and Have Antiproliferative Activity. J Med Chem 60:814-820 (2017)  
Target
Name:
Poly [ADP-ribose] polymerase tankyrase-1
Synonyms:
(ARTD5 or PARP5a) PARPL Poly [ADP-ribose] polymerase tankyrase-1 TINF1 TNKS1 Tankyrase 1 Tankyrase-1 Tankyrase-1 (TNKS1)
Type:
Enzyme
Mol. Mass.:
142058.03
Organism:
Homo sapiens (Human)
Description:
O95271
Residue:
1327
  
Inhibitor
Name:
BDBM50234921
Synonyms:
CHEMBL4059827
Type:
Small organic molecule
Emp. Form.:
C14H9F3N2O2S
Mol. Mass.:
326.294
SMILES:
FC(F)(F)c1ccc(cc1)-c1nc2CCSC(=O)c2c(=O)[nH]1
: