Target
Protein mono-ADP-ribosyltransferase PARP4
Ligand
BDBM50234916
Substrate
Meas. Tech.
ChEMBL_1654154 (CHEMBL4003520)
IC50
69000±n/a nM
Citation
 Nathubhai, AHaikarainen, TKoivunen, JMurthy, SKoumanov, FLloyd, MDHolman, GDPihlajaniemi, TTosh, DLehtiö, LThreadgill, MD Highly Potent and Isoform Selective Dual Site Binding Tankyrase/Wnt Signaling Inhibitors That Increase Cellular Glucose Uptake and Have Antiproliferative Activity. J Med Chem 60:814-820 (2017)  
Target
Name:
Protein mono-ADP-ribosyltransferase PARP4
Synonyms:
(ARTD4 or PARP4) 2.4.2.- ADP-ribosyltransferase diphtheria toxin-like 4 ADPRTL1 KIAA0177 PARP-4 PARP4 PARPL Poly [ADP-ribose] polymerase 4 VPARP | Vault poly(ADP-ribose) polymerase
Type:
Mol. Mass.:
192563.23
Organism:
Homo sapiens (Human)
Description:
Q9UKK3
Residue:
1724
  
Inhibitor
Name:
BDBM50234916
Synonyms:
CHEMBL4098188
Type:
Small organic molecule
Emp. Form.:
C27H21N5O3
Mol. Mass.:
463.4873
SMILES:
O=C(CCc1nc2ccccc2c(=O)[nH]1)Nc1ccc(cc1)C(=O)Nc1cccc2cccnc12
: