Target
UDP-N-acetylglucosamine 1-carboxyvinyltransferase
Ligand
BDBM50024894
Substrate
Meas. Tech.
ChEMBL_1654589 (CHEMBL4003955)
IC50
8800±n/a nM
Citation
 Ro?man, KLe?nik, SBrus, BHrast, MSova, MPatin, DBarreteau, HKonc, JJane?ic, DGobec, S Discovery of new MurA inhibitors using induced-fit simulation and docking. Bioorg Med Chem Lett 27:944-949 (2017)  
Target
Name:
UDP-N-acetylglucosamine 1-carboxyvinyltransferase
Synonyms:
EPT MURA_ECOLI UDP-N-acetylglucosamine 1-carboxyvinyltransferase murA | murZ
Type:
Protein
Mol. Mass.:
44814.62
Organism:
Escherichia coli K-12 (Enterobacteria)
Description:
E. coli MurA
Residue:
419
  
Inhibitor
Name:
BDBM50024894
Synonyms:
(1R, 2S)-1,2-epoxypropyl-phosphonic acid (2R,3S)-3-methyloxiran-2-ylphosphonic acid CHEMBL1757 Fosfomycin (compound 1) Fosfomycin Sodium phosphomycin
Type:
Small organic molecule
Emp. Form.:
C3H7O4P
Mol. Mass.:
138.059
SMILES:
C[C@@H]1O[C@@H]1P(O)(O)=O
: