Target
Sodium/glucose cotransporter 1
Ligand
BDBM50042976
Substrate
Meas. Tech.
ChEMBL_1654733 (CHEMBL4004099)
IC50
25400±n/a nM
Citation
 Jesus, ARVila-Viçosa, DMachuqueiro, MMarques, APDore, TMRauter, AP Targeting Type 2 Diabetes with C-Glucosyl Dihydrochalcones as Selective Sodium Glucose Co-Transporter 2 (SGLT2) Inhibitors: Synthesis and Biological Evaluation. J Med Chem 60:568-579 (2017)  
Target
Name:
Sodium/glucose cotransporter 1
Synonyms:
High affinity sodium-glucose cotransporter Na(+)/glucose cotransporter 1 SGLT1 Sodium-dependent glucose cotransporter 1 (SGLT1) Sodium/glucose cotransporter 1 (SGLT1) | Solute carrier family 5 member 1
Type:
Protein
Mol. Mass.:
73503.78
Organism:
Homo sapiens (Human)
Description:
P13866
Residue:
664
  
Inhibitor
Name:
BDBM50042976
Synonyms:
(E)-3-Phenyl-1-(2,4,6-trihydroxy-phenyl)-propenone 2',4',6'-trihydroxychalcone CHEMBL129371
Type:
Small organic molecule
Emp. Form.:
C15H12O4
Mol. Mass.:
256.2534
SMILES:
Oc1cc(O)c(C(=O)\C=C\c2ccccc2)c(O)c1
: