Target
Protein kinase C theta type
Ligand
BDBM33971
Substrate
Meas. Tech.
ChEMBL_1655178 (CHEMBL4004544)
IC50
1.000000±n/a nM
Citation
 van Eis, MJEvenou, JSchuler, WZenke, GVangrevelinghe, EWagner, Jvon Matt, P Indolyl-naphthyl-maleimides as potent and selective inhibitors of protein kinase C-a/ß. Bioorg Med Chem Lett 27:781-786 (2017)  
Target
Name:
Protein kinase C theta type
Synonyms:
KPCT_HUMAN PRKCT Protein kinase C theta type (PRKCQ) nPKC-theta
Type:
Serine/threonine-protein kinase
Mol. Mass.:
81878.04
Organism:
Homo sapiens (Human)
Description:
Full-length human PKC theta (Panvera Catalog No. P2996).
Residue:
706
  
Inhibitor
Name:
BDBM33971
Synonyms:
AEB071 med.21724, Compound 190
Type:
Small organic molecule
Emp. Form.:
C25H22N6O2
Mol. Mass.:
438.4812
SMILES:
CN1CCN(CC1)c1nc(C2=C(C(=O)NC2=O)c2c[nH]c3ccccc23)c2ccccc2n1
: