Target
Prostaglandin E2 receptor EP2 subtype
Ligand
BDBM50235370
Substrate
Meas. Tech.
ChEMBL_1655813 (CHEMBL4005283)
Ki
570±n/a nM
Citation
 Tran, TAKramer, BShin, YJVallar, PBoatman, PDZou, NSage, CRGharbaoui, TKrishnan, APal, BShakya, SRGarrido Montalban, AAdams, JWRamirez, JBehan, DPShifrina, ABlackburn, ALeakakos, TShi, YMorgan, MSadeque, AChen, WUnett, DJGaidarov, IChen, XChang, SShu, HHTung, SFSemple, G Discovery of 2-(((1r,4r)-4-(((4-Chlorophenyl)(phenyl)carbamoyl)oxy)methyl)cyclohexyl)methoxy)acetate (Ralinepag): An Orally Active Prostacyclin Receptor Agonist for the Treatment of Pulmonary Arterial Hypertension. J Med Chem 60:913-927 (2017)  
Target
Name:
Prostaglandin E2 receptor EP2 subtype
Synonyms:
PE2R2_HUMAN PTGER2 Prostaglandin E2 receptor Prostanoid EP2 Receptor
Type:
Enzyme
Mol. Mass.:
39775.71
Organism:
Homo sapiens (Human)
Description:
P43116
Residue:
358
  
Inhibitor
Name:
BDBM50235370
Synonyms:
CHEMBL3933704
Type:
Small organic molecule
Emp. Form.:
C23H26FNO5
Mol. Mass.:
415.4546
SMILES:
OC(=O)COC[C@H]1CC[C@H](COC(=O)N(c2ccccc2)c2cccc(F)c2)CC1
: