Target
Prostacyclin receptor
Ligand
BDBM50235370
Substrate
Meas. Tech.
ChEMBL_1655816 (CHEMBL4005286)
Ki
51±n/a nM
Citation
 Tran, TAKramer, BShin, YJVallar, PBoatman, PDZou, NSage, CRGharbaoui, TKrishnan, APal, BShakya, SRGarrido Montalban, AAdams, JWRamirez, JBehan, DPShifrina, ABlackburn, ALeakakos, TShi, YMorgan, MSadeque, AChen, WUnett, DJGaidarov, IChen, XChang, SShu, HHTung, SFSemple, G Discovery of 2-(((1r,4r)-4-(((4-Chlorophenyl)(phenyl)carbamoyl)oxy)methyl)cyclohexyl)methoxy)acetate (Ralinepag): An Orally Active Prostacyclin Receptor Agonist for the Treatment of Pulmonary Arterial Hypertension. J Med Chem 60:913-927 (2017)  
Target
Name:
Prostacyclin receptor
Synonyms:
PI2R_RAT Prostaglandin I2 | Ptgir
Type:
Enzyme Catalytic Domain
Mol. Mass.:
44673.87
Organism:
RAT
Description:
Prostaglandin I2 PTGIR RAT::P43253
Residue:
416
  
Inhibitor
Name:
BDBM50235370
Synonyms:
CHEMBL3933704
Type:
Small organic molecule
Emp. Form.:
C23H26FNO5
Mol. Mass.:
415.4546
SMILES:
OC(=O)COC[C@H]1CC[C@H](COC(=O)N(c2ccccc2)c2cccc(F)c2)CC1
: