Target
Histone deacetylase 6
Ligand
BDBM50361254
Substrate
Meas. Tech.
ChEMBL_1657747 (CHEMBL4007217)
Ki
20000±n/a nM
Citation
 Meyners, CWolff, BKleinschek, AKrämer, AMeyer-Almes, FJ Perfluorinated hydroxamic acids are potent and selective inhibitors of HDAC-like enzymes from Pseudomonas aeruginosa. Bioorg Med Chem Lett 27:1508-1512 (2017)  
Target
Name:
Histone deacetylase 6
Synonyms:
Cereblon/Histone deacetylase 6 HDAC6 Histone deacetylase 6 (HDAC6) KIAA0901 | ORF Names:JM21
Type:
Chromatin regulator; hydrolase; repressor
Mol. Mass.:
131381.51
Organism:
Homo sapiens (Human)
Description:
Q9UBN7
Residue:
1215
  
Inhibitor
Name:
BDBM50361254
Synonyms:
CHEMBL1934896
Type:
Small organic molecule
Emp. Form.:
C16H12F12N2O3
Mol. Mass.:
508.2589
SMILES:
Cc1ccc(NC(=O)C(F)(F)C(F)(F)C(F)(F)C(F)(F)C(F)(F)C(F)(F)C(=O)NO)cc1C
: