Target
Eukaryotic initiation factor 4A-III
Ligand
BDBM50235795
Substrate
Meas. Tech.
ChEMBL_1657827 (CHEMBL4007297)
IC50
5000±n/a nM
Citation
 Ito, MIwatani, MKamada, YSogabe, SNakao, STanaka, TKawamoto, TAparicio, SNakanishi, AImaeda, Y Discovery of selective ATP-competitive eIF4A3 inhibitors. Bioorg Med Chem 25:2200-2209 (2017)  
Target
Name:
Eukaryotic initiation factor 4A-III
Synonyms:
ATP-dependent RNA helicase DDX48 DDX48 EIF4A3 Eukaryotic translation initiation factor 4A isoform 3 KIAA0111 Nuclear matrix protein 265 eIF4A-III | hNMP 265
Type:
Protein
Mol. Mass.:
46871.02
Organism:
Homo sapiens (Human)
Description:
P38919
Residue:
411
  
Inhibitor
Name:
BDBM50235795
Synonyms:
CHEMBL4089069
Type:
Small organic molecule
Emp. Form.:
C12H12FNO2
Mol. Mass.:
221.2276
SMILES:
CC(C)c1cc(F)c2cc([nH]c2c1)C(O)=O
: