Target
Mitogen-activated protein kinase kinase kinase 10
Ligand
BDBM50235816
Substrate
Meas. Tech.
ChEMBL_1658111 (CHEMBL4007723)
IC50
4550±n/a nM
Citation
 Hoemann, MWilson, NArgiriadi, MBanach, DBurchat, ACalderwood, DClapham, BCox, PDuignan, DBKonopacki, DSomal, GVasudevan, A Synthesis and optimization of furano[3,2-d]pyrimidines as selective spleen tyrosine kinase (Syk) inhibitors. Bioorg Med Chem Lett 26:5562-5567 (2016)  
Target
Name:
Mitogen-activated protein kinase kinase kinase 10
Synonyms:
M3K10_HUMAN MLK2 Mitogen-activated protein kinase kinase kinase 10 | Mixed Lineage Kinase 2 (MLK2)
Type:
PROTEIN
Mol. Mass.:
103699.30
Organism:
Homo sapiens (Human)
Description:
ChEMBL_1460564
Residue:
954
  
Inhibitor
Name:
BDBM50235816
Synonyms:
CHEMBL4069365
Type:
Small organic molecule
Emp. Form.:
C19H18F3N5O3
Mol. Mass.:
421.3731
SMILES:
CC1(C)OCC(=O)Nc2cc(Nc3nc(NCC(F)(F)F)c4occc4n3)ccc12
: