Target
cGMP-dependent protein kinase 1
Ligand
BDBM50235816
Substrate
Meas. Tech.
ChEMBL_1658127 (CHEMBL4007739)
IC50
>10000±n/a nM
Citation
 Hoemann, MWilson, NArgiriadi, MBanach, DBurchat, ACalderwood, DClapham, BCox, PDuignan, DBKonopacki, DSomal, GVasudevan, A Synthesis and optimization of furano[3,2-d]pyrimidines as selective spleen tyrosine kinase (Syk) inhibitors. Bioorg Med Chem Lett 26:5562-5567 (2016)  
Target
Name:
cGMP-dependent protein kinase 1
Synonyms:
GMP-dependent protein kinase I PRKG1 PRKGR1A Protein Kinase G cGMP-dependent protein kinase 1 | cGMP-dependent protein kinase 1 beta
Type:
Protein
Mol. Mass.:
76358.04
Organism:
Homo sapiens (Human)
Description:
Q13976
Residue:
671
  
Inhibitor
Name:
BDBM50235816
Synonyms:
CHEMBL4069365
Type:
Small organic molecule
Emp. Form.:
C19H18F3N5O3
Mol. Mass.:
421.3731
SMILES:
CC1(C)OCC(=O)Nc2cc(Nc3nc(NCC(F)(F)F)c4occc4n3)ccc12
: