Target
Mineralocorticoid receptor
Ligand
BDBM50235934
Substrate
Meas. Tech.
ChEMBL_1658428 (CHEMBL4008040)
Ki
0.230000±n/a nM
Citation
 Martín-Martínez, MPérez-Gordillo, FLÁlvarez de la Rosa, DRodríguez, YGerona-Navarro, GGonzález-Muñiz, RZhou, MM Modulating Mineralocorticoid Receptor with Non-steroidal Antagonists. New Opportunities for the Development of Potent and Selective Ligands without Off-Target Side Effects. J Med Chem 60:2629-2650 (2017)  
Target
Name:
Mineralocorticoid receptor
Synonyms:
MCR MLR NR3C2 | Nuclear receptor subfamily 3 group C member 2
Type:
Enzyme
Mol. Mass.:
107076.42
Organism:
Homo sapiens (Human)
Description:
P08235
Residue:
984
  
Inhibitor
Name:
BDBM50235934
Synonyms:
CHEMBL4086416
Type:
Small organic molecule
Emp. Form.:
C30H25F2N5O2
Mol. Mass.:
525.5486
SMILES:
[H][C@]12C[C@@H](CN1CCOC2)n1c2ccc(\C=C3\c4ccc(F)cc4OCc4c(F)cccc34)cc2[nH]c1=NC#N
: