Target
Cytoplasmic tyrosine-protein kinase BMX
Ligand
BDBM50236076
Substrate
Meas. Tech.
ChEMBL_1658703 (CHEMBL4008315)
IC50
33±n/a nM
Citation
 Liang, XLv, FWang, BYu, KWu, HQi, ZJiang, ZChen, CWang, AMiao, WWang, WHu, ZLiu, JLiu, XZhao, ZWang, LZhang, SYe, ZWang, CRen, TWang, YLiu, QLiu, J Discovery of 2-((3-Acrylamido-4-methylphenyl)amino)-N-(2-methyl-5-(3,4,5-trimethoxybenzamido)phenyl)-4-(methylamino)pyrimidine-5-carboxamide (CHMFL-BMX-078) as a Highly Potent and Selective Type II Irreversible Bone Marrow Kinase in the X Chromosome (BMX) Kinase Inhibitor. J Med Chem 60:1793-1816 (2017)  
Target
Name:
Cytoplasmic tyrosine-protein kinase BMX
Synonyms:
BMX BMX_HUMAN Cytoplasmic tyrosine-protein kinase BMX (BMX) Epithelial and endothelial tyrosine kinase Tyrosine Kinase BMX | Tyrosine-protein kinase BMX/ETK
Type:
Tyrosine-protein kinase
Mol. Mass.:
78030.42
Organism:
Homo sapiens (Human)
Description:
P51813
Residue:
675
  
Inhibitor
Name:
BDBM50236076
Synonyms:
CHEMBL4098823
Type:
Small organic molecule
Emp. Form.:
C30H36N8O3
Mol. Mass.:
556.6586
SMILES:
CC(C)C[C@H](N)C(=O)Nc1ccc(C)c(c1)N1Cc2cnc(Nc3ccc(C)c(NC(=O)C=C)c3)nc2N(C)C1=O
: