Target
Cytoplasmic tyrosine-protein kinase BMX
Ligand
BDBM50236080
Substrate
Meas. Tech.
ChEMBL_1658703 (CHEMBL4008315)
IC50
225±n/a nM
Citation
 Liang, XLv, FWang, BYu, KWu, HQi, ZJiang, ZChen, CWang, AMiao, WWang, WHu, ZLiu, JLiu, XZhao, ZWang, LZhang, SYe, ZWang, CRen, TWang, YLiu, QLiu, J Discovery of 2-((3-Acrylamido-4-methylphenyl)amino)-N-(2-methyl-5-(3,4,5-trimethoxybenzamido)phenyl)-4-(methylamino)pyrimidine-5-carboxamide (CHMFL-BMX-078) as a Highly Potent and Selective Type II Irreversible Bone Marrow Kinase in the X Chromosome (BMX) Kinase Inhibitor. J Med Chem 60:1793-1816 (2017)  
Target
Name:
Cytoplasmic tyrosine-protein kinase BMX
Synonyms:
BMX BMX_HUMAN Cytoplasmic tyrosine-protein kinase BMX (BMX) Epithelial and endothelial tyrosine kinase Tyrosine Kinase BMX | Tyrosine-protein kinase BMX/ETK
Type:
Tyrosine-protein kinase
Mol. Mass.:
78030.42
Organism:
Homo sapiens (Human)
Description:
P51813
Residue:
675
  
Inhibitor
Name:
BDBM50236080
Synonyms:
CHEMBL4103856
Type:
Small organic molecule
Emp. Form.:
C32H33N7O5
Mol. Mass.:
595.6483
SMILES:
CNc1nc(Nc2ccc(C)c(NC(=O)C=C)c2)ncc1C(=O)Nc1cc(NC(=O)c2cc(OC)cc(OC)c2)ccc1C
: