Target
Free fatty acid receptor 1
Ligand
BDBM50019085
Substrate
Meas. Tech.
ChEMBL_1661200 (CHEMBL4010812)
EC50
32±n/a nM
Citation
 Li, HHuang, QChen, CXu, BWang, HYLong, YQ Discovery of Potent and Orally Bioavailable GPR40 Full Agonists Bearing Thiophen-2-ylpropanoic Acid Scaffold. J Med Chem 60:2697-2717 (2017)  
Target
Name:
Free fatty acid receptor 1
Synonyms:
FFAR1 G-protein Coupled Receptor 40 | GPR40
Type:
G Protein-Coupled Receptor (GPCR)
Mol. Mass.:
31473.32
Organism:
Homo sapiens (Human)
Description:
O14842
Residue:
300
  
Inhibitor
Name:
BDBM50019085
Synonyms:
CHEMBL3288346
Type:
Small organic molecule
Emp. Form.:
C22H22O3S
Mol. Mass.:
366.473
SMILES:
Cc1cccc(C)c1-c1cccc(COc2ccc(CCC(O)=O)s2)c1
: