Target
Aldehyde dehydrogenase 1A1
Ligand
BDBM50236896
Substrate
Meas. Tech.
ChEMBL_1659725 (CHEMBL4009337)
IC50
340±n/a nM
Citation
 Buchman, CDHurley, TD Inhibition of the Aldehyde Dehydrogenase 1/2 Family by Psoralen and Coumarin Derivatives. J Med Chem 60:2439-2455 (2017)  
Target
Name:
Aldehyde dehydrogenase 1A1
Synonyms:
AL1A1_HUMAN ALDH-E1 ALDH1A1 Aldehyde dehydrogenase 1A1 (ALDH1A1) Aldehyde dehydrogenase family 1 member A1 (ALDH1A1) PUMB1 RalDH1 | Retinal dehydrogenase 1
Type:
Protein
Mol. Mass.:
54862.21
Organism:
Homo sapiens (Human)
Description:
Residue:
501
  
Inhibitor
Name:
BDBM50236896
Synonyms:
CHEMBL4064364
Type:
Small organic molecule
Emp. Form.:
C16H16O3
Mol. Mass.:
256.2964
SMILES:
CCCc1c(C)c2cc3c(C)coc3cc2oc1=O
: