Target
Transmembrane protease serine 6
Ligand
BDBM50236927
Substrate
Meas. Tech.
ChEMBL_1659751 (CHEMBL4009363)
Ki
5.3±n/a nM
Citation
 St-Georges, CDésilets, ABéliveau, FGhinet, MDion, SPColombo, ÉBoudreault, PLNajmanovich, RJLeduc, RMarsault, É Modulating the selectivity of matriptase-2 inhibitors with unnatural amino acids. Eur J Med Chem 129:110-123 (2017)  
Target
Name:
Transmembrane protease serine 6
Synonyms:
Matriptase-2 TMPS6_HUMAN
Type:
PROTEIN
Mol. Mass.:
90001.12
Organism:
Homo sapiens (Human)
Description:
ChEMBL_1442547
Residue:
811
  
Inhibitor
Name:
BDBM50236927
Synonyms:
CHEMBL4065870
Type:
Small organic molecule
Emp. Form.:
C44H46N8O6S
Mol. Mass.:
814.951
SMILES:
N[C@@H](Cc1ccc(O)cc1)C(=O)N[C@@H](Cc1ccc(O)cc1)C(=O)N[C@@H](Cc1ccc2ccccc2c1)C(=O)N[C@@H](CCCNC(N)=N)C(=O)c1nc2ccccc2s1
: