Target
Cystic fibrosis transmembrane conductance regulator
Ligand
BDBM50237285
Substrate
Meas. Tech.
ChEMBL_1659971 (CHEMBL4009583)
EC50
>10000±n/a nM
Citation
 Son, JHZhu, JSPhuan, PWCil, OTeuthorn, APKu, CKLee, SVerkman, ASKurth, MJ High-Potency Phenylquinoxalinone Cystic Fibrosis Transmembrane Conductance Regulator (CFTR) Activators. J Med Chem 60:2401-2410 (2017)  
Target
Name:
Cystic fibrosis transmembrane conductance regulator
Synonyms:
ABCC7 CFTR Channel conductance-controlling ATPase | cAMP-dependent chloride channel
Type:
Enzyme Catalytic Domain
Mol. Mass.:
168171.30
Organism:
Homo sapiens (Human)
Description:
gi_90421313
Residue:
1480
  
Inhibitor
Name:
BDBM50237285
Synonyms:
CHEMBL4092001
Type:
Small organic molecule
Emp. Form.:
C22H13F4N3
Mol. Mass.:
395.3523
SMILES:
Fc1ccc2nc3n(Cc4ccccc4)c4ccc(cc4nc3c2c1)C(F)(F)F
: