Target
5'-AMP-activated protein kinase catalytic subunit alpha-1
Ligand
BDBM50334268
Substrate
Meas. Tech.
ChEMBL_1661531 (CHEMBL4011143)
IC50
13804±n/a nM
Citation
 Gibson, TSJohnson, BFanjul, AHalkowycz, PDougan, DRCole, DSwann, S Structure-based drug design of novel ASK1 inhibitors using an integrated lead optimization strategy. Bioorg Med Chem Lett 27:1709-1713 (2017)  
Target
Name:
5'-AMP-activated protein kinase catalytic subunit alpha-1
Synonyms:
AAPK1_HUMAN AMP-activated protein kinase alpha-1/beta-2/gamma-2 AMPK subunit alpha-1 AMPK1 PRKAA1 | Tau-protein kinase PRKAA1
Type:
Protein
Mol. Mass.:
64023.62
Organism:
Homo sapiens (Human)
Description:
Q13131
Residue:
559
  
Inhibitor
Name:
BDBM50334268
Synonyms:
CHEMBL1642655 N-(6-(1H-imidazol-1-yl)imidazo[1,2-a]pyridin-2-yl)-4-tert-butylbenzamide
Type:
Small organic molecule
Emp. Form.:
C21H21N5O
Mol. Mass.:
359.4243
SMILES:
CC(C)(C)c1ccc(cc1)C(=O)Nc1cn2cc(ccc2n1)-n1ccnc1
: