Target
P2Y purinoceptor 4
Ligand
BDBM50268878
Substrate
Meas. Tech.
ChEMBL_1661636 (CHEMBL4011248)
IC50
3450±n/a nM
Citation
 Rafehi, MMalik, EMNeumann, AAbdelrahman, AHanck, TNamasivayam, VMüller, CEBaqi, Y Development of Potent and Selective Antagonists for the UTP-Activated P2Y J Med Chem 60:3020-3038 (2017)  
Target
Name:
P2Y purinoceptor 4
Synonyms:
NRU P2RY4 P2Y purinoceptor 4 Pyrimidinergic receptor P2Y4 Uridine nucleotide receptor
Type:
PROTEIN
Mol. Mass.:
40977.17
Organism:
Homo sapiens (Human)
Description:
ChEMBL_751027
Residue:
365
  
Inhibitor
Name:
BDBM50268878
Synonyms:
CHEMBL495605 | Sodium 1-Amino-4-(4-benzylphenylamino)-9,10-dioxo-9,10-dihydroanthracene-2-sulfonate
Type:
Small organic molecule
Emp. Form.:
C27H19N2O5S
Mol. Mass.:
483.516
SMILES:
Nc1c(cc(Nc2ccc(Cc3ccccc3)cc2)c2C(=O)c3ccccc3C(=O)c12)S([O-])(=O)=O
: