Target
P2Y purinoceptor 4
Ligand
BDBM50336770
Substrate
Meas. Tech.
ChEMBL_1661636 (CHEMBL4011248)
IC50
1940±n/a nM
Citation
 Rafehi, MMalik, EMNeumann, AAbdelrahman, AHanck, TNamasivayam, VMüller, CEBaqi, Y Development of Potent and Selective Antagonists for the UTP-Activated P2Y J Med Chem 60:3020-3038 (2017)  
Target
Name:
P2Y purinoceptor 4
Synonyms:
NRU P2RY4 P2Y purinoceptor 4 Pyrimidinergic receptor P2Y4 Uridine nucleotide receptor
Type:
PROTEIN
Mol. Mass.:
40977.17
Organism:
Homo sapiens (Human)
Description:
ChEMBL_751027
Residue:
365
  
Inhibitor
Name:
BDBM50336770
Synonyms:
CHEMBL597203 sodium 1-amino-9,10-dioxo-4-(4-phenoxyphenylamino)-9,10-dihydroanthracene-2-sulfonate
Type:
Small organic molecule
Emp. Form.:
C26H17N2O6S
Mol. Mass.:
485.489
SMILES:
Nc1c(cc(Nc2ccc(Oc3ccccc3)cc2)c2C(=O)c3ccccc3C(=O)c12)S([O-])(=O)=O
: