Target
P2Y purinoceptor 4
Ligand
BDBM50237572
Substrate
Meas. Tech.
ChEMBL_1661636 (CHEMBL4011248)
IC50
1760±n/a nM
Citation
 Rafehi, MMalik, EMNeumann, AAbdelrahman, AHanck, TNamasivayam, VMüller, CEBaqi, Y Development of Potent and Selective Antagonists for the UTP-Activated P2Y J Med Chem 60:3020-3038 (2017)  
Target
Name:
P2Y purinoceptor 4
Synonyms:
NRU P2RY4 P2Y purinoceptor 4 Pyrimidinergic receptor P2Y4 Uridine nucleotide receptor
Type:
PROTEIN
Mol. Mass.:
40977.17
Organism:
Homo sapiens (Human)
Description:
ChEMBL_751027
Residue:
365
  
Inhibitor
Name:
BDBM50237572
Synonyms:
CHEMBL4065831
Type:
Small organic molecule
Emp. Form.:
C26H16BrN2NaO6S
Mol. Mass.:
587.374
SMILES:
[Na+].Nc1c2C(=O)c3ccccc3C(=O)c2c(Nc2ccc(Oc3ccc(Br)cc3)cc2)cc1S([O-])(=O)=O
: