Target
Bile salt export pump
Ligand
BDBM50134036
Substrate
Meas. Tech.
ChEMBL_1661988 (CHEMBL4011669)
IC50
57000±n/a nM
Citation
 Aleo, MDLuo, YSwiss, RBonin, PDPotter, DMWill, Y Human drug-induced liver injury severity is highly associated with dual inhibition of liver mitochondrial function and bile salt export pump. Hepatology 60:1015-22 (2014)  
Target
Name:
Bile salt export pump
Synonyms:
ABCB11 ATP-binding cassette sub-family B member 11 Bile Salt Export Pump, BSEP Bile salt export pump (BSEP)
Type:
Protein
Mol. Mass.:
146405.49
Organism:
Homo sapiens (Human)
Description:
O95342
Residue:
1321
  
Inhibitor
Name:
BDBM50134036
Synonyms:
2-(2,3-Dimethyl-phenylamino)-benzoic acid 2-(2,3-dimethylphenylamino)benzoic acid CI-473 INF-3355 Ponstel mefanamic acid
Type:
Small organic molecule
Emp. Form.:
C15H15NO2
Mol. Mass.:
241.2851
SMILES:
Cc1cccc(Nc2ccccc2C(O)=O)c1C
: