Target
Bile salt export pump
Ligand
BDBM31773
Substrate
Meas. Tech.
ChEMBL_1661988 (CHEMBL4011669)
IC50
13400±n/a nM
Citation
 Aleo, MDLuo, YSwiss, RBonin, PDPotter, DMWill, Y Human drug-induced liver injury severity is highly associated with dual inhibition of liver mitochondrial function and bile salt export pump. Hepatology 60:1015-22 (2014)  
Target
Name:
Bile salt export pump
Synonyms:
ABCB11 ATP-binding cassette sub-family B member 11 Bile Salt Export Pump, BSEP Bile salt export pump (BSEP)
Type:
Protein
Mol. Mass.:
146405.49
Organism:
Homo sapiens (Human)
Description:
O95342
Residue:
1321
  
Inhibitor
Name:
BDBM31773
Synonyms:
ECONAZOLE Gyno-pevaryl cid_68589
Type:
Small organic molecule
Emp. Form.:
C18H15Cl3N2O
Mol. Mass.:
381.684
SMILES:
Clc1ccc(COC(Cn2ccnc2)c2ccc(Cl)cc2Cl)cc1
: