Target
Serine/threonine-protein kinase PAK 1
Ligand
BDBM101536
Substrate
Meas. Tech.
ChEBML_1662473
IC50
14±n/a nM
Citation
 Hao, CHuang, WLi, XGuo, JChen, MYan, ZWang, KJiang, XSong, SWang, JZhao, DLi, FCheng, M Development of 2, 4-diaminoquinazoline derivatives as potent PAK4 inhibitors by the core refinement strategy. Eur J Med Chem 131:1-13 (2017)  
Target
Name:
Serine/threonine-protein kinase PAK 1
Synonyms:
2.7.11.1 Cell division control protein 42 homolog PAK-1 PAK1_HUMAN p21-activated kinase 1 | p65-PAK
Type:
Mol. Mass.:
60640.15
Organism:
Homo sapiens (Human)
Description:
Q13153
Residue:
545
  
Inhibitor
Name:
BDBM101536
Synonyms:
CHEMBL3128043 US8530652, 114 | US8530652, 63
Type:
Small organic molecule
Emp. Form.:
C25H30N8OS
Mol. Mass.:
490.624
SMILES:
CN(C)C[C@@H](NC(=O)N1Cc2c(Nc3nc(C)nc4ccsc34)[nH]nc2C1(C)C)c1ccccc1
: